{"text_format":"1","workbook":"xlsx","n_sheets":12,"sheets":["Program Summary","APR 5 Year Projection","Program Info","Space, Nonrecurring, Library","College Exp Projections","College Spending Plan","Table 5","Assumptions","Calculation Worksheet","Data Pull","Data Validation","Gen Ed Requirements"],"not_rendered":{"charts":0,"images":0,"macros":1,"external_links":2,"defined_names":43,"comments":4,"pivot_tables":0},"unopened":[],"bounds":{"document_bytes":16777216,"sheet_cells":100000,"rows_first":2000,"rows_last":500,"rows_between":2000,"halvings":0,"cell_chars":16384,"cell_head_chars":4096},"cells_cut":0,"cells_raw":0,"read":"whole","date_system":"1900"}

{"sheet":"Program Summary","index":0,"n_rows":51,"n_cols":12,"rows_kept":51,"cut":false,"hidden":false,"merged":[[5,9,8,10],[0,8,13,8],[0,9,0,10],[0,11,0,13],[3,0,3,6],[4,0,4,6],[0,0,0,6],[1,0,1,6],[2,0,2,6]]}
[{"$f":"'Program Info'!E11","v":0},null,null,null,null,null,null,null,"REPORT GENERATION COMMANDS","Windows Users",null,"MAC Users"]
[{"$f":"'Program Info'!E10","v":0}]
[{"$f":"'Program Info'!B1","v":"ACADEMIC PROGRAM PROPOSAL PROJECTION"}]
[{"$f":"IF('Program Info'!E15=\"YES\",\"***ILI AFFILIATION - ILI TUITION RATE APPLIED***\",\"\")","v":""}]
[{"$f":"CONCATENATE('Program Info'!$B$6,\":  \",'Program Info'!$E$6)","v":"PROGRAM DEVELOPMENT PHASE:  "}]
[]
[null,{"$f":"'Program Info'!E17","v":0},{"$f":"'Program Info'!F17","v":"0-1"},{"$f":"'Program Info'!G17","v":{"$error":"#VALUE!"}},{"$f":"'Program Info'!H17","v":{"$error":"#VALUE!"}},{"$f":"'Program Info'!I17","v":{"$error":"#VALUE!"}},"5 Year Total"]
["YEAR",1,2,3,4,5]
[]
["PLANNED ENROLLMENT"]
{"$rows_left_out":42}
{"sheet":"APR 5 Year Projection","index":1,"n_rows":59,"n_cols":8,"rows_kept":59,"cut":false,"hidden":false,"merged":[[4,0,4,6],[0,0,0,6],[1,0,1,6],[2,0,2,6],[3,0,3,6]]}
[{"$f":"'Program Info'!E11","v":0}]
[{"$f":"'Program Info'!E10","v":0}]
[{"$f":"'Program Info'!B1","v":"ACADEMIC PROGRAM PROPOSAL PROJECTION"}]
[{"$f":"IF('Program Info'!E15=\"YES\",\"***ILI AFFILIATION - ILI TUITION RATE APPLIED***\",\"\")","v":""}]
[{"$f":"CONCATENATE('Program Info'!$B$6,\":  \",'Program Info'!$E$6)","v":"PROGRAM DEVELOPMENT PHASE:  "}]
[]
[null,{"$f":"'Program Info'!E17","v":0},{"$f":"'Program Info'!F17","v":"0-1"},{"$f":"'Program Info'!G17","v":{"$error":"#VALUE!"}},{"$f":"'Program Info'!H17","v":{"$error":"#VALUE!"}},{"$f":"'Program Info'!I17","v":{"$error":"#VALUE!"}},"5 Year Total"]
[]
["Revenue"]
["Tuition",{"$f":"'Calculation Worksheet'!E203","v":{"$error":"#N/A"}},{"$f":"'Calculation Worksheet'!F203","v":{"$error":"#N/A"}},{"$f":"'Calculation Worksheet'!G203","v":{"$error":"#N/A"}},{"$f":"'Calculation Worksheet'!H203","v":{"$error":"#N/A"}},{"$f":"'Calculation Worksheet'!I203","v":{"$error":"#N/A"}},{"$f":"SUM(B10:F10)","v":{"$error":"#N/A"}}]
{"$rows_left_out":50}
{"sheet":"Program Info","index":2,"n_rows":145,"n_cols":14,"rows_kept":145,"cut":false,"hidden":false,"merged":[[132,4,132,8],[126,4,126,8],[113,4,113,8],[99,4,99,8],[85,4,85,8],[132,2,144,2],[126,2,130,2],[85,2,97,2],[99,2,111,2],[113,2,125,2],[54,2,54,8],[71,4,71,8],[58,4,58,8],[71,2,83,2],[58,2,69,2],[31,10,33,10],[50,3,50,8],[12,4,12,6],[13,4,13,6],[9,4,9,6]]}
[null,"ACADEMIC PROGRAM PROPOSAL PROJECTION"]
[null,"For questions, please contact Leanne Hill, lkhcto@rit.edu"]
[null,"Please submit to Leanne Hill for review prior to submission to Academic Affairs"]
[]
[]
[null,"PROGRAM DEVELOPMENT PHASE"]
[null,"Anticipated Start Date"]
[]
[null,null,null,"Today's Date:"]
[null,null,null,"Enter name of program:"]
{"$rows_left_out":136}
{"sheet":"Space, Nonrecurring, Library","index":3,"n_rows":28,"n_cols":12,"rows_kept":28,"cut":false,"hidden":false,"merged":[[27,0,27,11],[20,0,20,5],[26,0,26,11],[21,0,21,5],[10,0,10,5],[13,0,13,5],[16,0,16,5],[18,0,18,5],[4,0,4,5],[7,0,7,5],[8,0,8,5],[15,0,15,5],[12,0,12,5]]}
[{"$f":"'Program Info'!B1","v":"ACADEMIC PROGRAM PROPOSAL PROJECTION"}]
["Space, Nonrecurring and Library Costs"]
[{"$f":"CONCATENATE('Program Info'!$B$6,\":  \",'Program Info'!$E$6)","v":"PROGRAM DEVELOPMENT PHASE:  "}]
[]
["The purpose of this worksheet is to identify any space needs, capital costs and other non-recurring needs to launch the program.  Listed items will be part of the dialogue in new program approval."]
[]
[]
["Dedicated Space Needs",null,null,null,null,null,null,"Preferred Location","Square Feet","Space Type","Cost Per Sq Foot","Projected Capital Costs"]
[null,null,null,null,null,null,null,null,null,null,{"$f":"IF(J9=\"\",\"\",VLOOKUP(J9,Assumptions!$A$61:$B$64,2,FALSE))","v":""},{"$f":"IF(I9=\"\",0,I9*K9)","v":0}]
[]
{"$rows_left_out":19}
{"sheet":"College Exp Projections","index":4,"n_rows":95,"n_cols":7,"rows_kept":95,"cut":false,"hidden":true,"merged":[[2,1,2,5],[0,0,0,6],[1,0,1,6]]}
[{"$f":"'Program Info'!E10","v":0}]
["College Expense Projections"]
[null,"YEAR"]
[null,{"$f":"'Program Summary'!B7","v":0},{"$f":"'Program Summary'!C7","v":"0-1"},{"$f":"'Program Summary'!D7","v":{"$error":"#VALUE!"}},{"$f":"'Program Summary'!E7","v":{"$error":"#VALUE!"}},{"$f":"'Program Summary'!F7","v":{"$error":"#VALUE!"}},{"$f":"'Program Summary'!G7","v":"5 Year Total"}]
[]
["Total College"]
["Salary",{"$f":"B17+B26+B34+B42+B50+B66+B74+B82+B90","v":{"$error":"#N/A"}},{"$f":"C17+C26+C34+C42+C50+C66+C74+C82+C90","v":{"$error":"#N/A"}},{"$f":"D17+D26+D34+D42+D50+D66+D74+D82+D90","v":{"$error":"#N/A"}},{"$f":"E17+E26+E34+E42+E50+E66+E74+E82+E90","v":{"$error":"#N/A"}},{"$f":"F17+F26+F34+F42+F50+F66+F74+F82+F90","v":{"$error":"#N/A"}},{"$f":"SUM(B7:F7)","v":{"$error":"#N/A"}}]
["Non Salary",{"$f":"B18+B27+B35+B43+B51+B67+B75+B83+B91","v":{"$error":"#N/A"}},{"$f":"C18+C27+C35+C43+C51+C67+C75+C83+C91","v":{"$error":"#N/A"}},{"$error":"#N/A"},{"$error":"#N/A"},{"$error":"#N/A"},{"$f":"SUM(B8:F8)","v":{"$error":"#N/A"}}]
["College Overhead",{"$f":"B19+B28+B36+B44+B52+B68+B76+B84+B92","v":{"$error":"#N/A"}},{"$error":"#N/A"},{"$error":"#N/A"},{"$error":"#N/A"},{"$error":"#N/A"},{"$f":"SUM(B9:F9)","v":{"$error":"#N/A"}}]
["Academic Affairs",{"$f":"B20+B29+B37+B45+B53+B69+B77+B85+B93","v":{"$error":"#N/A"}},{"$error":"#N/A"},{"$error":"#N/A"},{"$error":"#N/A"},{"$error":"#N/A"},{"$f":"SUM(B10:F10)","v":{"$error":"#N/A"}}]
{"$rows_left_out":86}
{"sheet":"College Spending Plan","index":5,"n_rows":106,"n_cols":8,"rows_kept":106,"cut":false,"hidden":false,"merged":[[3,0,3,6],[61,0,61,6],[71,2,71,6],[5,2,5,6],[6,2,6,6],[12,2,12,6],[65,2,65,6]]}
[{"$f":"'Program Info'!E11","v":0},null,null,null,null,"Secondary College",{"$f":"A66","v":"N/A"},{"$f":"IF('Program Info'!E12<>\"N/A\",49,0)","v":0}]
[{"$f":"'Program Summary'!A2:G2","v":0}]
["Detailed College Spending Plan"]
[{"$f":"CONCATENATE('Program Info'!$B$6,\":  \",'Program Info'!$E$6)","v":"PROGRAM DEVELOPMENT PHASE:  "}]
[]
[{"$f":"A1","v":0}]
[{"$f":"CONCATENATE(\"YEAR 5 PLAN STATUS:  \",UPPER(G55))","v":{"$error":"#N/A"}},null,"Year"]
[null,null,{"$f":"'Program Summary'!B7","v":0},{"$f":"'Program Summary'!C7","v":"0-1"},{"$f":"'Program Summary'!D7","v":{"$error":"#VALUE!"}},{"$f":"'Program Summary'!E7","v":{"$error":"#VALUE!"}},{"$f":"'Program Summary'!F7","v":{"$error":"#VALUE!"}},"Total"]
[null,null,1,2,3,4,5]
[]
{"$rows_left_out":97}
{"sheet":"Table 5","index":6,"n_rows":50,"n_cols":6,"rows_kept":50,"cut":false,"hidden":false,"merged":[[9,0,9,3],[25,1,25,3]]}
[{"$f":"'Program Info'!B1","v":"ACADEMIC PROGRAM PROPOSAL PROJECTION"}]
["Table 5: New Resources"]
[{"$f":"CONCATENATE(\"College:  \",'Program Info'!E11)","v":"College:  "}]
[{"$f":"CONCATENATE(\"Program Name:  \",'Program Info'!E10)","v":"Program Name:  "}]
[]
[{"$f":"CONCATENATE('Program Info'!$B$6,\":  \",'Program Info'!$E$6)","v":"PROGRAM DEVELOPMENT PHASE:  "}]
[]
["Table 5: New Resources"]
[]
["List the costs of the new resources that will be engaged specifically as a result of the new program (e.g., a new faculty position or additional library resources).  New resources for a given year should be carried over to the following year(s), with adjustments for inflation, if they represent a continuing cost."]
{"$rows_left_out":41}
{"sheet":"Assumptions","index":7,"n_rows":83,"n_cols":26,"rows_kept":83,"cut":false,"hidden":false,"merged":[[1,0,1,9]]}
[]
["ASSUMPTIONS"]
[]
[null,"= calculated rates"]
[]
[]
["Rate Year","2014-2015"]
["Year of Plan",{"$f":"'Program Info'!E7","v":0}]
["Expense Gap",{"$f":"RIGHT(B8,4)-RIGHT(B7,4)","v":-2015}]
["Inflation",2.5000000000000001E-2]
{"$rows_left_out":74}
{"sheet":"Calculation Worksheet","index":8,"n_rows":213,"n_cols":27,"rows_kept":213,"cut":false,"hidden":false,"merged":[[10,0,10,17]]}
[{"$f":"'Program Summary'!A1","v":0}]
[{"$f":"'Program Summary'!A2","v":0}]
["Calculation Worksheet"]
[]
[]
[]
[]
[]
[]
[]
{"$rows_left_out":204}
{"sheet":"Data Pull","index":9,"n_rows":64,"n_cols":16,"rows_kept":64,"cut":false,"hidden":true,"merged":[]}
["Program Name","Home College","Home Department","Program Type","ILI Affiliation","Status","Anticipated Start","Data Source","Transaction Type",{"$f":"'Program Summary'!B7","v":0},{"$f":"'Program Summary'!C7","v":"0-1"},{"$f":"'Program Summary'!D7","v":{"$error":"#VALUE!"}},{"$f":"'Program Summary'!E7","v":{"$error":"#VALUE!"}},{"$f":"'Program Summary'!F7","v":{"$error":"#VALUE!"}},"Total","Upload"]
[{"$f":"'Program Info'!$E$10","v":0},{"$f":"'Program Info'!$E$11","v":0},{"$f":"'Program Info'!$E$13","v":0},{"$f":"'Program Info'!$E$14","v":0},{"$f":"'Program Info'!$E$15","v":"NO"},{"$f":"'Program Info'!$E$6","v":0},{"$f":"'Program Info'!$E$7","v":0},"Projection",{"$f":"'APR 5 Year Projection'!A10","v":"Tuition"},{"$f":"'APR 5 Year Projection'!B10","v":{"$error":"#N/A"}},{"$f":"'APR 5 Year Projection'!C10","v":{"$error":"#N/A"}},{"$f":"'APR 5 Year Projection'!D10","v":{"$error":"#N/A"}},{"$f":"'APR 5 Year Projection'!E10","v":{"$error":"#N/A"}},{"$f":"'APR 5 Year Projection'!F10","v":{"$error":"#N/A"}},{"$f":"'APR 5 Year Projection'!G10","v":{"$error":"#N/A"}},"X"]
[{"$f":"'Program Info'!$E$10","v":0},{"$f":"'Program Info'!$E$11","v":0},{"$f":"'Program Info'!$E$13","v":0},{"$f":"'Program Info'!$E$14","v":0},{"$f":"'Program Info'!$E$15","v":"NO"},{"$f":"'Program Info'!$E$6","v":0},{"$f":"'Program Info'!$E$7","v":0},"Projection",{"$f":"'APR 5 Year Projection'!A11","v":"Unfunded Aid"},{"$f":"'APR 5 Year Projection'!B11","v":{"$error":"#N/A"}},{"$f":"'APR 5 Year Projection'!C11","v":{"$error":"#N/A"}},{"$f":"'APR 5 Year Projection'!D11","v":{"$error":"#N/A"}},{"$f":"'APR 5 Year Projection'!E11","v":{"$error":"#N/A"}},{"$f":"'APR 5 Year Projection'!F11","v":{"$error":"#N/A"}},{"$f":"'APR 5 Year Projection'!G11","v":{"$error":"#N/A"}},"X"]
[{"$f":"'Program Info'!$E$10","v":0},{"$f":"'Program Info'!$E$11","v":0},{"$f":"'Program Info'!$E$13","v":0},{"$f":"'Program Info'!$E$14","v":0},{"$f":"'Program Info'!$E$15","v":"NO"},{"$f":"'Program Info'!$E$6","v":0},{"$f":"'Program Info'!$E$7","v":0},"Projection",{"$f":"'APR 5 Year Projection'!A12","v":"Net Tuition"},{"$f":"'APR 5 Year Projection'!B12","v":{"$error":"#N/A"}},{"$f":"'APR 5 Year Projection'!C12","v":{"$error":"#N/A"}},{"$f":"'APR 5 Year Projection'!D12","v":{"$error":"#N/A"}},{"$f":"'APR 5 Year Projection'!E12","v":{"$error":"#N/A"}},{"$f":"'APR 5 Year Projection'!F12","v":{"$error":"#N/A"}},{"$f":"'APR 5 Year Projection'!G12","v":{"$error":"#N/A"}},"X"]
[{"$f":"'Program Info'!$E$10","v":0},{"$f":"'Program Info'!$E$11","v":0},{"$f":"'Program Info'!$E$13","v":0},{"$f":"'Program Info'!$E$14","v":0},{"$f":"'Program Info'!$E$15","v":"NO"},{"$f":"'Program Info'!$E$6","v":0},{"$f":"'Program Info'!$E$7","v":0},"Projection",{"$f":"CONCATENATE('APR 5 Year Projection'!A16,\"\",\" Faculty Projection\")","v":"CAST Faculty Projection"},{"$f":"'APR 5 Year Projection'!B16","v":{"$error":"#N/A"}},{"$f":"'APR 5 Year Projection'!C16","v":{"$error":"#N/A"}},{"$f":"'APR 5 Year Projection'!D16","v":{"$error":"#N/A"}},{"$f":"'APR 5 Year Projection'!E16","v":{"$error":"#N/A"}},{"$f":"'APR 5 Year Projection'!F16","v":{"$error":"#N/A"}},{"$f":"'APR 5 Year Projection'!G16","v":{"$error":"#N/A"}},"X"]
[{"$f":"'Program Info'!$E$10","v":0},{"$f":"'Program Info'!$E$11","v":0},{"$f":"'Program Info'!$E$13","v":0},{"$f":"'Program Info'!$E$14","v":0},{"$f":"'Program Info'!$E$15","v":"NO"},{"$f":"'Program Info'!$E$6","v":0},{"$f":"'Program Info'!$E$7","v":0},"Projection",{"$f":"CONCATENATE('APR 5 Year Projection'!A17,\"\",\" Faculty Projection\")","v":"CHST Faculty Projection"},{"$f":"'APR 5 Year Projection'!B17","v":{"$error":"#N/A"}},{"$f":"'APR 5 Year Projection'!C17","v":{"$error":"#N/A"}},{"$f":"'APR 5 Year Projection'!D17","v":{"$error":"#N/A"}},{"$f":"'APR 5 Year Projection'!E17","v":{"$error":"#N/A"}},{"$f":"'APR 5 Year Projection'!F17","v":{"$error":"#N/A"}},{"$f":"'APR 5 Year Projection'!G17","v":{"$error":"#N/A"}},"X"]
[{"$f":"'Program Info'!$E$10","v":0},{"$f":"'Program Info'!$E$11","v":0},{"$f":"'Program Info'!$E$13","v":0},{"$f":"'Program Info'!$E$14","v":0},{"$f":"'Program Info'!$E$15","v":"NO"},{"$f":"'Program Info'!$E$6","v":0},{"$f":"'Program Info'!$E$7","v":0},"Projection",{"$f":"CONCATENATE('APR 5 Year Projection'!A18,\"\",\" Faculty Projection\")","v":"CIAS Faculty Projection"},{"$f":"'APR 5 Year Projection'!B18","v":{"$error":"#N/A"}},{"$f":"'APR 5 Year Projection'!C18","v":{"$error":"#N/A"}},{"$f":"'APR 5 Year Projection'!D18","v":{"$error":"#N/A"}},{"$f":"'APR 5 Year Projection'!E18","v":{"$error":"#N/A"}},{"$f":"'APR 5 Year Projection'!F18","v":{"$error":"#N/A"}},{"$f":"'APR 5 Year Projection'!G18","v":{"$error":"#N/A"}},"X"]
[{"$f":"'Program Info'!$E$10","v":0},{"$f":"'Program Info'!$E$11","v":0},{"$f":"'Program Info'!$E$13","v":0},{"$f":"'Program Info'!$E$14","v":0},{"$f":"'Program Info'!$E$15","v":"NO"},{"$f":"'Program Info'!$E$6","v":0},{"$f":"'Program Info'!$E$7","v":0},"Projection",{"$f":"CONCATENATE('APR 5 Year Projection'!A19,\"\",\" Faculty Projection\")","v":"COLA Faculty Projection"},{"$f":"'APR 5 Year Projection'!B19","v":{"$error":"#N/A"}},{"$f":"'APR 5 Year Projection'!C19","v":{"$error":"#N/A"}},{"$f":"'APR 5 Year Projection'!D19","v":{"$error":"#N/A"}},{"$f":"'APR 5 Year Projection'!E19","v":{"$error":"#N/A"}},{"$f":"'APR 5 Year Projection'!F19","v":{"$error":"#N/A"}},{"$f":"'APR 5 Year Projection'!G19","v":{"$error":"#N/A"}},"X"]
[{"$f":"'Program Info'!$E$10","v":0},{"$f":"'Program Info'!$E$11","v":0},{"$f":"'Program Info'!$E$13","v":0},{"$f":"'Program Info'!$E$14","v":0},{"$f":"'Program Info'!$E$15","v":"NO"},{"$f":"'Program Info'!$E$6","v":0},{"$f":"'Program Info'!$E$7","v":0},"Projection",{"$f":"CONCATENATE('APR 5 Year Projection'!A20,\"\",\" Faculty Projection\")","v":"COS Faculty Projection"},{"$f":"'APR 5 Year Projection'!B20","v":{"$error":"#N/A"}},{"$f":"'APR 5 Year Projection'!C20","v":{"$error":"#N/A"}},{"$f":"'APR 5 Year Projection'!D20","v":{"$error":"#N/A"}},{"$f":"'APR 5 Year Projection'!E20","v":{"$error":"#N/A"}},{"$f":"'APR 5 Year Projection'!F20","v":{"$error":"#N/A"}},{"$f":"'APR 5 Year Projection'!G20","v":{"$error":"#N/A"}},"X"]
[{"$f":"'Program Info'!$E$10","v":0},{"$f":"'Program Info'!$E$11","v":0},{"$f":"'Program Info'!$E$13","v":0},{"$f":"'Program Info'!$E$14","v":0},{"$f":"'Program Info'!$E$15","v":"NO"},{"$f":"'Program Info'!$E$6","v":0},{"$f":"'Program Info'!$E$7","v":0},"Projection",{"$f":"CONCATENATE('APR 5 Year Projection'!A21,\"\",\" Faculty Projection\")","v":"COS-CIS Faculty Projection"},{"$f":"'APR 5 Year Projection'!B21","v":{"$error":"#N/A"}},{"$f":"'APR 5 Year Projection'!C21","v":{"$error":"#N/A"}},{"$f":"'APR 5 Year Projection'!D21","v":{"$error":"#N/A"}},{"$f":"'APR 5 Year Projection'!E21","v":{"$error":"#N/A"}},{"$f":"'APR 5 Year Projection'!F21","v":{"$error":"#N/A"}},{"$f":"'APR 5 Year Projection'!G21","v":{"$error":"#N/A"}},"X"]
{"$rows_left_out":55}
{"sheet":"Data Validation","index":10,"n_rows":15,"n_cols":13,"rows_kept":15,"cut":false,"hidden":true,"merged":[[0,0,14,0]]}
["<<<Program Info Tab >>>","Projection Stage",null,"Fiscal Year",null,"College List",null,"Program Typ","Level",null,"ILI",null,"Summer"]
[null,"CONCEPT PAPER",null,"2015-2016",null,"N/A",null,"Bachelors 4 yr","UG",null,"NO",null,"NO"]
[null,"FULL PROGRAM DEVELOPMENT",null,"2016-2017",null,"CAST",null,"Bachelors 5 yr w/Coop","UG",null,"YES",null,"YES"]
[null,null,null,"2017-2018",null,"CHST",null,"Bachelors 5 yr w/o Coop","UG"]
[null,null,null,"2018-2019",null,"CIAS",null,"Masters - 1 yr 30","Grad"]
[null,null,null,"2019-2020",null,"COLA",null,"Masters - 1 yr 36","Grad"]
[null,null,null,"2020-2021",null,"COS",null,"Masters - 2 yr 30","Grad"]
[null,null,null,"2021-2022",null,"COS-CIS",null,"Masters - 2 yr 36","Grad"]
[null,null,null,"2022-2023",null,"GCCIS",null,"Masters - 2 yr 60","Grad"]
[null,null,null,"2023-2024",null,"GIS"]
{"$rows_left_out":6}
{"sheet":"Gen Ed Requirements","index":11,"n_rows":40,"n_cols":5,"rows_kept":40,"cut":false,"hidden":false,"merged":[[39,0,39,15],[19,0,19,15],[22,0,22,15],[35,0,35,15],[36,0,36,15],[37,0,37,15],[38,0,38,15],[13,0,14,0],[13,1,14,1],[13,2,14,2],[13,3,14,3],[13,4,14,4],[11,1,12,1],[11,2,12,2],[11,3,12,3],[11,4,12,4],[1,0,1,15],[7,1,9,1],[7,2,9,2],[7,3,9,3],[7,4,9,4]]}
["Overview:"]
["Each type of degree award requires a different number of general education credits as mandated by the New York State Education Department (NYSED).  When providing guidance, NYSED uses the term “liberal arts and sciences” to refer to general education. In accordance with NYSED’s guidelines, students in the following programs must complete, at a minimum, the number of credits indicated in each category, as illustrated in Table 1."]
[]
[]
["Table 1. The table shows the minimum number of semester credit hours (sch) required in each category.  Details can be found in the sections below for each degree program."]
[]
[null,"BS","BFA","AAS ","AS"]
["Foundation ",6,6,6,6]
["First-Year Seminar*"]
["First-Year Writing Intensive course"]
{"$rows_left_out":30}