{"text_format":"1","workbook":"xlsx","n_sheets":15,"sheets":["Program Summary","APR 5 Year Projection","Prgm Cost Drivers (ALL)","Program Info","Space, Nonrecurring, Library","College Exp Projections","College Spending Plan","Table 5","ReqCollege APR Profile","ReqMarginal Impact Analysis","Assumptions","Calculation Worksheet","Gen Ed Requirements","Data Validation","Sheet1"],"not_rendered":{"charts":0,"images":2,"macros":1,"external_links":1,"defined_names":75,"comments":4,"pivot_tables":0},"unopened":[],"bounds":{"document_bytes":16777216,"sheet_cells":100000,"rows_first":2000,"rows_last":500,"rows_between":2000,"halvings":0,"cell_chars":16384,"cell_head_chars":4096},"cells_cut":0,"cells_raw":0,"read":"whole","date_system":"1900"}

{"sheet":"Program Summary","index":0,"n_rows":61,"n_cols":10,"rows_kept":61,"cut":false,"hidden":false,"merged":[[4,8,6,8],[0,7,11,7],[0,9,0,11],[0,0,0,6],[1,0,1,6],[2,0,2,6],[3,0,3,2]]}
[{"$f":"'Program Info'!E11","v":0},null,null,null,null,null,null,"REPORT GENERATION COMMANDS",null,"MAC Users"]
[{"$f":"'Program Info'!E10","v":0}]
[{"$f":"'Program Info'!B1","v":"ACADEMIC PROGRAM PROPOSAL PROJECTION"}]
[{"$f":"CONCATENATE('Program Info'!$B$6,\":  \",'Program Info'!$E$6)","v":"PROGRAM DEVELOPMENT PHASE:  "},null,null,{"$f":"IF('Program Info'!E15=\"YES\",\"***ONLINE PROGRAM - ONLINE TUITION RATE APPLIED***\",\"\")","v":""}]
[null,{"$f":"'Program Info'!E17","v":0},{"$f":"'Program Info'!F17","v":"0-1"},{"$f":"'Program Info'!G17","v":{"$error":"#VALUE!"}},{"$f":"'Program Info'!H17","v":{"$error":"#VALUE!"}},{"$f":"'Program Info'!I17","v":{"$error":"#VALUE!"}},"5 Year Total"]
["YEAR",1,2,3,4,5]
[]
["PLANNED ENROLLMENT"]
["Continuing Students",null,{"$f":"B14","v":{"$error":"#N/A"}},{"$f":"C14","v":{"$error":"#N/A"}},{"$f":"D14","v":{"$error":"#N/A"}},{"$f":"E14","v":{"$error":"#N/A"}}]
["New Student Intake",{"$f":"'Program Info'!E49","v":0},{"$f":"'Program Info'!F49","v":0},{"$f":"'Program Info'!G49","v":0},{"$f":"'Program Info'!H49","v":0},{"$f":"'Program Info'!I49","v":0}]
{"$rows_left_out":52}
{"sheet":"APR 5 Year Projection","index":1,"n_rows":128,"n_cols":8,"rows_kept":128,"cut":false,"hidden":false,"merged":[[4,0,4,6],[0,0,0,6],[1,0,1,6],[2,0,2,6],[3,0,3,6]]}
[{"$f":"'Program Info'!E11","v":0}]
[{"$f":"'Program Info'!E10","v":0}]
[{"$f":"'Program Info'!B1","v":"ACADEMIC PROGRAM PROPOSAL PROJECTION"}]
[{"$f":"IF('Program Info'!E15=\"YES\",\"***ILI AFFILIATION - ILI TUITION RATE APPLIED***\",\"\")","v":""}]
[{"$f":"CONCATENATE('Program Info'!$B$6,\":  \",'Program Info'!$E$6)","v":"PROGRAM DEVELOPMENT PHASE:  "}]
[]
[null,{"$f":"'Program Info'!E17","v":0},{"$f":"'Program Info'!F17","v":"0-1"},{"$f":"'Program Info'!G17","v":{"$error":"#VALUE!"}},{"$f":"'Program Info'!H17","v":{"$error":"#VALUE!"}},{"$f":"'Program Info'!I17","v":{"$error":"#VALUE!"}},"5 Year Total"]
[]
["Revenue"]
["Tuition",{"$f":"'Calculation Worksheet'!E203","v":{"$error":"#N/A"}},{"$f":"'Calculation Worksheet'!F203","v":{"$error":"#N/A"}},{"$f":"'Calculation Worksheet'!G203","v":{"$error":"#N/A"}},{"$f":"'Calculation Worksheet'!H203","v":{"$error":"#N/A"}},{"$f":"'Calculation Worksheet'!I203","v":{"$error":"#N/A"}},{"$f":"SUM(B10:F10)","v":{"$error":"#N/A"}}]
{"$rows_left_out":119}
{"sheet":"Prgm Cost Drivers (ALL)","index":2,"n_rows":233,"n_cols":25,"rows_kept":233,"cut":false,"hidden":true,"merged":[]}
[]
[1,2,2,3,4,5,6,7,8,9,10,11,12,13,14,15,16,17,18,19,20,21]
["College","Plan Name","Academic Plan Codes","Level ","Other","Home Discipline","Gross Tuition","Unfunded Aid","Net Tuition","Net Tuition/CH","Average Cost/CH","College Res Exp","College Level Surplus/(Deficit)","Academic Affairs Surplus/(Deficit)","Fully Allocated Surplus/(Deficit)","Surplus/Deficit Per CH","CH","CH - Home College","CH - HC % of Total","Home College Cost","Home College Cost Per CH","Home College % of Total Exp","2014-2015","2015-2016","2016-2017"]
["CAST","Airforce ROTC","AFORCE-NON","N","N",null,44006.106857270745,0,44006.106857270745,1158.055443612388,798.74894440235448,30352.459887289471,13653.646969981273,9422.5606621014158,4637.712729988365,359.30649921003351,38,29,0.76315789473684215,26664.029634216153,919.44929773159151,0.87848002215405607,9,15,14]
["CAST","Army ROTC","ARMY-NON","N","N",null,143861.18654699746,0,143861.18654699746,1208.9175340083821,409.64161738701256,48747.352469054495,95113.834077942971,88171.498132094188,74440.995180051192,799.27591662136945,119,119,1,48747.352469054495,409.64161738701256,1,23,18,10]
["CAST","Applied Technical Leadership","ATLEAD-BS","B","N",null,14243.900033918862,0,14243.900033918862,949.59333559459083,411.52587618627842,6172.888142794176,8071.0118911246864,6975.8509566532111,5195.6897258575027,538.0674594083124,15,3,0.2,1909.1131117708528,636.3710372569509,0.30927388729689292,0,0,3]
["CAST","Computer Engrg Tech","CPET-BS","B","N",null,4789796.4975314653,-1938369.2912088512,2851427.2063226141,695.30046484335867,466.56446329529882,1913380.8639740206,938046.34234859352,657348.38978006924,172856.42183291446,228.73600154805987,4101,1948,0.47500609607412825,1253301.1317677551,643.37840439823162,0.65501916286791717,130,155,151]
["CAST","Civil Engineering Tech","CVET-BS","B","N",null,8636249.2947611548,-3585668.5241577001,5050580.7706034547,672.60364503974631,440.69231202725302,3309158.5710126432,1741422.1995908115,1246218.7382615022,361314.22028927319,231.9113330124932,7509,3905,0.52004261552803299,2171283.7270191135,556.02656261693051,0.65614375389532154,286,294,286]
["CAST","Electical Engineering Technology","EEET-BS","B","N",null,3661513.541438519,-1479521.7221218988,2181991.81931662,697.79079607183246,494.73930106435279,1547049.7944282312,634942.02488838881,409073.58919155295,35479.864242582582,203.05149500747964,3127,1810,0.57882954908858331,1156854.1077696877,639.14591589485508,0.74778078374474388,144,131,116]
["CAST","Environmental Health & Safety Mgmt","EHSM-MS","M","N",null,723757.43507074867,-197703.85110123828,526053.58396951039,1033.5040942426531,943.70731449153334,480347.0230761905,45706.560893319896,3886.8076301098918,-57615.762562007993,89.796779751119644,509,435,0.85461689587426326,385788.67789205787,886.87052388978816,0.80314576620341793,31,28,38]
{"$rows_left_out":224}
{"sheet":"Program Info","index":3,"n_rows":145,"n_cols":15,"rows_kept":145,"cut":false,"hidden":false,"merged":[[31,10,33,10],[50,3,50,8],[12,4,12,6],[13,4,13,6],[9,4,9,6],[54,2,54,8],[71,4,71,8],[58,4,58,8],[71,2,83,2],[58,2,69,2],[132,2,144,2],[126,2,130,2],[85,2,97,2],[99,2,111,2],[113,2,125,2],[132,4,132,8],[126,4,126,8],[113,4,113,8],[99,4,99,8],[85,4,85,8]]}
[null,"ACADEMIC PROGRAM PROPOSAL PROJECTION"]
[null,"For questions, please contact Leanne Hill, lkhcto@rit.edu"]
[null,"Please submit to Leanne Hill for review prior to submission to Academic Affairs"]
[]
[null,null,null,null,null,null,null,null,null,null,null,null,null,{"$f":"SUM('APR 5 Year Projection'!B128:F128)","v":{"$error":"#N/A"}}]
[null,"PROGRAM DEVELOPMENT PHASE"]
[null,"Anticipated Start Date"]
[]
[null,null,null,"Today's Date:"]
[null,null,null,"Enter name of program:"]
{"$rows_left_out":136}
{"sheet":"Space, Nonrecurring, Library","index":4,"n_rows":28,"n_cols":12,"rows_kept":28,"cut":false,"hidden":false,"merged":[[4,0,4,5],[7,0,7,5],[8,0,8,5],[15,0,15,5],[12,0,12,5],[27,0,27,11],[20,0,20,5],[26,0,26,11],[21,0,21,5],[10,0,10,5],[13,0,13,5],[16,0,16,5],[18,0,18,5]]}
[{"$f":"'Program Info'!B1","v":"ACADEMIC PROGRAM PROPOSAL PROJECTION"}]
["Space, Nonrecurring and Library Costs"]
[{"$f":"CONCATENATE('Program Info'!$B$6,\":  \",'Program Info'!$E$6)","v":"PROGRAM DEVELOPMENT PHASE:  "}]
[]
["The purpose of this worksheet is to identify any space needs, capital costs and other non-recurring needs to launch the program.  Listed items will be part of the dialogue in new program approval."]
[]
[]
["Dedicated Space Needs",null,null,null,null,null,null,"Preferred Location","Square Feet","Space Type","Cost Per Sq Foot","Projected Capital Costs"]
[null,null,null,null,null,null,null,null,null,null,{"$f":"IF(J9=\"\",\"\",VLOOKUP(J9,Assumptions!$A$62:$B$65,2,FALSE))","v":""},{"$f":"IF(I9=\"\",0,I9*K9)","v":0}]
[]
{"$rows_left_out":19}
{"sheet":"College Exp Projections","index":5,"n_rows":95,"n_cols":7,"rows_kept":95,"cut":false,"hidden":true,"merged":[[2,1,2,5],[0,0,0,6],[1,0,1,6]]}
[{"$f":"'Program Info'!E10","v":0}]
["College Expense Projections"]
[null,"YEAR"]
[null,{"$f":"'Program Summary'!B5","v":0},{"$f":"'Program Summary'!C5","v":"0-1"},{"$f":"'Program Summary'!D5","v":{"$error":"#VALUE!"}},{"$f":"'Program Summary'!E5","v":{"$error":"#VALUE!"}},{"$f":"'Program Summary'!F5","v":{"$error":"#VALUE!"}},{"$f":"'Program Summary'!G5","v":"5 Year Total"}]
[]
["Total College"]
["Salary",{"$f":"B17+B26+B34+B42+B50+B66+B74+B82+B90","v":{"$error":"#N/A"}},{"$f":"C17+C26+C34+C42+C50+C66+C74+C82+C90","v":{"$error":"#N/A"}},{"$f":"D17+D26+D34+D42+D50+D66+D74+D82+D90","v":{"$error":"#N/A"}},{"$f":"E17+E26+E34+E42+E50+E66+E74+E82+E90","v":{"$error":"#N/A"}},{"$f":"F17+F26+F34+F42+F50+F66+F74+F82+F90","v":{"$error":"#N/A"}},{"$f":"SUM(B7:F7)","v":{"$error":"#N/A"}}]
["Non Salary",{"$f":"B18+B27+B35+B43+B51+B67+B75+B83+B91","v":{"$error":"#N/A"}},{"$f":"C18+C27+C35+C43+C51+C67+C75+C83+C91","v":{"$error":"#N/A"}},{"$error":"#N/A"},{"$error":"#N/A"},{"$error":"#N/A"},{"$f":"SUM(B8:F8)","v":{"$error":"#N/A"}}]
["College Overhead",{"$f":"B19+B28+B36+B44+B52+B68+B76+B84+B92","v":{"$error":"#N/A"}},{"$error":"#N/A"},{"$error":"#N/A"},{"$error":"#N/A"},{"$error":"#N/A"},{"$f":"SUM(B9:F9)","v":{"$error":"#N/A"}}]
["Academic Affairs",{"$f":"B20+B29+B37+B45+B53+B69+B77+B85+B93","v":{"$error":"#N/A"}},{"$error":"#N/A"},{"$error":"#N/A"},{"$error":"#N/A"},{"$error":"#N/A"},{"$f":"SUM(B10:F10)","v":{"$error":"#N/A"}}]
{"$rows_left_out":86}
{"sheet":"College Spending Plan","index":6,"n_rows":106,"n_cols":8,"rows_kept":106,"cut":false,"hidden":false,"merged":[[3,0,3,6],[61,0,61,6],[71,2,71,6],[5,2,5,6],[6,2,6,6],[12,2,12,6],[65,2,65,6]]}
[{"$f":"'Program Info'!E11","v":0},null,null,null,null,"Secondary College",{"$f":"A66","v":"N/A"},{"$f":"IF('Program Info'!E12<>\"N/A\",49,0)","v":0}]
[{"$f":"'Program Summary'!A2:G2","v":0}]
["Detailed College Spending Plan"]
[{"$f":"CONCATENATE('Program Info'!$B$6,\":  \",'Program Info'!$E$6)","v":"PROGRAM DEVELOPMENT PHASE:  "}]
[]
[{"$f":"A1","v":0}]
[{"$f":"CONCATENATE(\"YEAR 5 PLAN STATUS:  \",UPPER(G55))","v":{"$error":"#N/A"}},null,"Year"]
[null,null,{"$f":"'Program Info'!E17","v":0},{"$f":"'Program Info'!F17","v":"0-1"},{"$f":"'Program Info'!G17","v":{"$error":"#VALUE!"}},{"$f":"'Program Info'!H17","v":{"$error":"#VALUE!"}},{"$f":"'Program Info'!I17","v":{"$error":"#VALUE!"}},"Total"]
[null,null,1,2,3,4,5]
[]
{"$rows_left_out":97}
{"sheet":"Table 5","index":7,"n_rows":50,"n_cols":8,"rows_kept":50,"cut":false,"hidden":false,"merged":[[9,0,9,3],[25,1,25,3]]}
[{"$f":"'Program Info'!B1","v":"ACADEMIC PROGRAM PROPOSAL PROJECTION"}]
["Table 5: New Resources"]
[{"$f":"CONCATENATE(\"College:  \",'Program Info'!E11)","v":"College:  "}]
[{"$f":"CONCATENATE(\"Program Name:  \",'Program Info'!E10)","v":"Program Name:  "}]
[]
[{"$f":"CONCATENATE('Program Info'!$B$6,\":  \",'Program Info'!$E$6)","v":"PROGRAM DEVELOPMENT PHASE:  "}]
[]
["Table 5: New Resources"]
[]
["List the costs of the new resources that will be engaged specifically as a result of the new program (e.g., a new faculty position or additional library resources).  New resources for a given year should be carried over to the following year(s), with adjustments for inflation, if they represent a continuing cost."]
{"$rows_left_out":41}
{"sheet":"ReqCollege APR Profile","index":8,"n_rows":64,"n_cols":10,"rows_kept":64,"cut":false,"hidden":true,"merged":[[0,1,0,9],[1,1,1,9],[2,1,2,9]]}
[null,{"$f":"'Program Summary'!A1:A1","v":0}]
[null,"APR COLLEGE FINANCIAL PROFILE"]
[null,"APR YEAR 2015-2016"]
[]
[]
[null,"Select College",{"$f":"HomeCollege","v":0}]
[null,"Degree Level",{"$f":"IF(dtype=\"UG\",\"B\",\"M\")","v":{"$error":"#N/A"}},{"$f":"IF(C7=\"B\",\"Undergraduate\",\"Graduate\")","v":{"$error":"#N/A"}}]
[]
[null,"Program Name","Gross Tuition","Net Tuition","Net Tuition Rate","College Contribution","Academic Affairs Contribution","Fully Allocated Contribution","Total Student Credit Hours","Home College Credit Hours"]
[{"$f":"IF(B10=\"\",\"\",1)","v":""},{"$f":"IF(COUNTIFS('Prgm Cost Drivers (ALL)'!A:A,$C$6,'Prgm Cost Drivers (ALL)'!D:D,$C$7)<ROWS($B$10:B10),\"\",INDEX('Prgm Cost Drivers (ALL)'!C:C,SMALL(IF(('Prgm Cost Drivers (ALL)'!$A$4:$A$233=$C$6)+('Prgm Cost Drivers (ALL)'!$D$4:$D$233=$C$7)=2,ROW('Prgm Cost Drivers (ALL)'!$D$4:$D$233)),ROW(D1))))","v":""},{"$f":"IF(B10=\"\",\"\",SUMIFS(PCD_GTui,'Prgm Cost Drivers (ALL)'!C:C,'ReqCollege APR Profile'!B10))","v":""},{"$f":"IF(B10=\"\",\"\",SUMIFS(PCD_NTui,'Prgm Cost Drivers (ALL)'!C:C,'ReqCollege APR Profile'!B10))","v":""},{"$f":"IF(B10=\"\",\"\",D10/C10)","v":""},{"$f":"IF($B10=\"\",\"\",SUMIFS(PCD_PgmFL,'Prgm Cost Drivers (ALL)'!$C:$C,$B10))","v":""},{"$f":"IF($B10=\"\",\"\",SUMIFS('Prgm Cost Drivers (ALL)'!N:N,'Prgm Cost Drivers (ALL)'!$C:$C,$B10))","v":""},{"$f":"IF($B10=\"\",\"\",SUMIFS('Prgm Cost Drivers (ALL)'!O:O,'Prgm Cost Drivers (ALL)'!$C:$C,$B10))","v":""},{"$f":"IF(B10=\"\",\"\",SUMIFS('Prgm Cost Drivers (ALL)'!Q:Q,'Prgm Cost Drivers (ALL)'!$C:$C,$B10))","v":""},{"$f":"IF(B10=\"\",\"\",SUMIFS('Prgm Cost Drivers (ALL)'!R:R,'Prgm Cost Drivers (ALL)'!C:C,B10))","v":""}]
{"$rows_left_out":55}
{"sheet":"ReqMarginal Impact Analysis","index":9,"n_rows":58,"n_cols":9,"rows_kept":58,"cut":false,"hidden":true,"merged":[[57,0,57,6],[41,0,41,6],[42,0,42,6],[0,0,0,6],[1,0,1,6],[2,0,2,6],[6,0,6,6],[7,0,7,6],[20,0,20,6],[21,0,21,6],[37,0,37,6],[4,0,4,6]]}
[{"$f":"'Program Summary'!A1:G1","v":0}]
[{"$f":"'Program Summary'!A2:G2","v":0}]
["COST ANALYTICS"]
[]
["***Applies to Home College Only***"]
[]
["College Spending Plan"]
[{"$f":"'Program Summary'!B41","v":{"$error":"#N/A"}}]
[null,{"$f":"'APR 5 Year Projection'!B7","v":0},{"$f":"'APR 5 Year Projection'!C7","v":"0-1"},{"$f":"'APR 5 Year Projection'!D7","v":{"$error":"#VALUE!"}},{"$f":"'APR 5 Year Projection'!E7","v":{"$error":"#VALUE!"}},{"$f":"'APR 5 Year Projection'!F7","v":{"$error":"#VALUE!"}},"Total"]
["Instructional Costs"]
{"$rows_left_out":49}
{"sheet":"Assumptions","index":10,"n_rows":102,"n_cols":26,"rows_kept":102,"cut":false,"hidden":true,"merged":[[1,0,1,9]]}
[]
["ASSUMPTIONS"]
[]
[null,"= calculated rates"]
[]
[]
["APR Cost Rate Year","2015-2016"]
["Start and End Year of Plan",{"$f":"'Program Info'!E7","v":0},{"$f":"'APR 5 Year Projection'!F7","v":{"$error":"#VALUE!"}}]
["Expense Gap",{"$f":"RIGHT(B8,4)-RIGHT(B7,4)","v":-2016},{"$f":"RIGHT(C8,4)-RIGHT(B7,4)","v":{"$error":"#VALUE!"}}]
["Inflation",2.5000000000000001E-2]
{"$rows_left_out":93}
{"sheet":"Calculation Worksheet","index":11,"n_rows":216,"n_cols":27,"rows_kept":216,"cut":false,"hidden":true,"merged":[[10,0,10,17]]}
[{"$f":"'Program Summary'!A1","v":0}]
[{"$f":"'Program Summary'!A2","v":0}]
["Calculation Worksheet"]
[]
[]
[]
[]
[]
[]
[]
{"$rows_left_out":207}
{"sheet":"Gen Ed Requirements","index":12,"n_rows":40,"n_cols":5,"rows_kept":40,"cut":false,"hidden":false,"merged":[[11,1,12,1],[11,2,12,2],[11,3,12,3],[11,4,12,4],[1,0,1,15],[7,1,9,1],[7,2,9,2],[7,3,9,3],[7,4,9,4],[13,0,14,0],[13,1,14,1],[13,2,14,2],[13,3,14,3],[13,4,14,4],[39,0,39,15],[19,0,19,15],[22,0,22,15],[35,0,35,15],[36,0,36,15],[37,0,37,15],[38,0,38,15]]}
["Overview:"]
["Each type of degree award requires a different number of general education credits as mandated by the New York State Education Department (NYSED).  When providing guidance, NYSED uses the term “liberal arts and sciences” to refer to general education. In accordance with NYSED’s guidelines, students in the following programs must complete, at a minimum, the number of credits indicated in each category, as illustrated in Table 1."]
[]
[]
["Table 1. The table shows the minimum number of semester credit hours (sch) required in each category.  Details can be found in the sections below for each degree program."]
[]
[null,"BS","BFA","AAS ","AS"]
["Foundation ",6,6,6,6]
["First-Year Seminar*"]
["First-Year Writing Intensive course"]
{"$rows_left_out":31}
{"sheet":"Data Validation","index":13,"n_rows":20,"n_cols":15,"rows_kept":20,"cut":false,"hidden":true,"merged":[[0,0,14,0]]}
["<<<Program Info Tab >>>","Projection Stage",null,"Fiscal Year",null,"College List",null,"Program Typ","Level","Student Status","ILI",null,"Summer","Analytics","Budget Office Review"]
[null,"CONCEPT PAPER",null,"2018-2019",null,"N/A",null,"Bachelors 4 yr","UG","FT","NO",null,"NO",{"$f":"IF(O2=\"YES\",\"NO\",IF(OR('APR 5 Year Projection'!F48<0,'Program Summary'!F47<0,'Program Info'!M51<0,'Program Summary'!G53=-1),\"YES\",\"NO\"))","v":{"$error":"#N/A"}},"NO"]
[null,"FULL PROGRAM DEVELOPMENT",null,"2019-2020",null,"CAST",null,"Bachelors 5 yr w/Coop","UG","FTC","YES",null,"YES"]
[null,null,null,"2020-2021",null,"CHST",null,"Bachelors 5 yr w/o Coop","UG","FT"]
[null,null,null,"2021-2022",null,"CIAS",null,"Masters - 1 yr 30","Grad","FT"]
[null,null,null,"2022-2023",null,"COLA",null,"Masters - 1 yr 36","Grad","FT"]
[null,null,null,"2023-2024",null,"COS",null,"Masters - 2 yr 30","Grad","PT"]
[null,null,null,"2024-2025",null,"COS-CIS",null,"Masters - 2 yr 36","Grad","PT"]
[null,null,null,"2025-2026",null,"GCCIS",null,"Masters - 2 yr 60","Grad","FT"]
[null,"USE MODE",null,"2026-2027",null,"GIS"]
{"$rows_left_out":11}
{"sheet":"Sheet1","index":14,"n_rows":0,"n_cols":0,"rows_kept":0,"cut":false,"hidden":true,"merged":[]}