{"text_format":"1","workbook":"xlsx","n_sheets":8,"sheets":["Instructions","Customer Info","Log Sheet","Overview","Department","Loss Reason","Surplus","Recycling"],"not_rendered":{"charts":6,"images":10,"macros":1,"external_links":0,"defined_names":1,"comments":3,"pivot_tables":28},"unopened":[],"bounds":{"document_bytes":16777216,"sheet_cells":100000,"rows_first":2000,"rows_last":500,"rows_between":2000,"halvings":0,"cell_chars":16384,"cell_head_chars":4096},"cells_cut":0,"cells_raw":0,"read":"whole","date_system":"1900"}

{"sheet":"Instructions","index":0,"n_rows":22,"n_cols":10,"rows_kept":22,"cut":false,"hidden":false,"merged":[[7,11,11,12],[7,13,7,18],[11,2,11,7],[9,2,10,7],[17,0,19,1],[17,2,19,7],[21,0,23,1],[21,2,23,7],[0,0,3,7],[5,0,7,1],[5,2,7,7],[9,0,11,1],[13,2,15,7],[13,0,15,1]]}
["INSTRUCTIONS                                        Food Waste Assessment Results"]
[]
[]
[]
[]
["Step 1",null,"Hit the Enable Content button at the top of the screen."]
[]
[]
[]
["Step 2",null,"Enter sales information into the Customer Info tab."]
[]
[null,null,"These values are used to scale the results."]
[]
["Step 3",null,"Enter data from the log sheet into the Log Sheet tab."]
[]
[]
[]
["Step 4",null,"Click the \"VIEW RESULTS\" button."]
[]
[null,null,null,null,null,null,null,null,null," "]
[]
["Step 5",null,"Review the (5) green tabs to see results."]

{"sheet":"Customer Info","index":1,"n_rows":17,"n_cols":15,"rows_kept":17,"cut":false,"hidden":false,"merged":[[15,1,15,3],[16,1,16,3],[4,0,4,14],[0,0,3,14],[5,0,6,14],[12,1,12,3],[14,1,14,3],[8,6,8,14],[13,1,13,3],[9,1,9,4],[10,1,10,4],[8,1,8,4],[12,6,12,14]]}
["Food Waste Assessment"]
[]
[]
[]
[]
["Customer / Sales Volume Information"]
[]
[]
[null,"Color Code:",null,null,null,null,"Week of Assessment - Total Weekly Sales "]
[null,"Required Information",null,null,null,null,"Current","Sunday","Monday","Tuesday","Wednesday","Thursday","Friday","Saturday","Average"]
[null,"Optional Information",null,null,null,null,"Week 1",null,null,null,null,null,null,null,{"$f":"SUM(H11:N11)/7","v":0}]
[]
[null,"Full-Store Average Weekly Hours Worked",null,null,null,null,"Prior Weeks - Total Weekly Sales (Optional)"]
[null,"Day of the Week Assessment is Performed",null,null,null,null,"Previous","Sunday","Monday","Tuesday","Wednesday","Thursday","Friday","Saturday","Average"]
[null,"Average Daily Sales Volume",null,null,{"$f":"IF(O17=0,IF(O16=0,IF(O15=0,O11,AVERAGE(O15,O11)),AVERAGE(O11,O15,O16)),AVERAGE(O11,O15,O16,O17))","v":0},null,"Week 2",null,null,null,null,null,null,null,{"$f":"SUM(H15:N15)/7","v":0}]
[null,"Assessment Day Sales",null,null,{"$f":"IF(E14=\"Sunday\",H11,IF(E14=\"Monday\",I11,IF(E14=\"Tuesday\",J11,IF(E14=\"Wednesday\",K11,IF(E14=\"Thursday\",L11,IF(E14=\"Friday\",M11,IF(E14=\"Saturday\",N11,)))))))","v":0},null,"Week 3",null,null,null,null,null,null,null,{"$f":"SUM(H16:N16)/7","v":0}]
[null,"Assessment Day Sales Scaling Factor",null,null,{"$f":"IF(E16=0,,E15/E16)","v":0},null,"Week 4",null,null,null,null,null,null,null,{"$f":"SUM(H17:N17)/7","v":0}]

{"sheet":"Log Sheet","index":2,"n_rows":727,"n_cols":14,"rows_kept":727,"cut":false,"hidden":false,"merged":[[2,0,3,2],[2,3,3,4],[6,0,6,8],[1,0,1,2],[1,3,1,4]]}
[null,null,null,null,null,null,null,null,null,null,null,null,"If donation","If All other disposal methods"]
["Assessment Date:",null,null,null,null,null,null,null,"Color Code:",null,null,null,"surplus","prep waste"]
["Team Members:",null,null,null,null,null,null,null,"Required Information",null,null,null,null,"expired"]
[null,null,null,null,null,null,null,null,"Optional Information",null,null,null,null,"plate waste"]
[null,null,null,null,null,null,null,null,null,null,null,null,null,"surplus"]
[null,null,null,null,null,null,null,null,null,null,null,null,null,"quality"]
["LOG SHEET - Study Data",null,null,null,null,null,null,null,null,null,null,null,null,"return"]
["Time / Meal Service","Time Frame  (hrs) - leave blank if 24","Source Location","Disposal Method","Loss Reason","Food Description","Container Weight (lbs)","Total Weight (lbs)","Notes","Food Weight (lbs)","Scaled Food Weight (lbs)",null,null,"other"]
[null,null,null,null,null,null,null,null,null,{"$f":"H9-G9","v":0},{"$f":"IF('Customer Info'!$E$17=0,J9*(IF(B9=0, 1,24/B9)),J9*'Customer Info'!$E$17*(IF(B9=0, 1,24/B9)))","v":0}]
[null,null,null,null,null,null,null,null,null,{"$f":"H10-G10","v":0},{"$f":"IF('Customer Info'!$E$17=0,J10*(IF(B10=0, 1,24/B10)),J10*'Customer Info'!$E$17*(IF(B10=0, 1,24/B10)))","v":0}]
[null,null,null,null,null,null,null,null,null,0,{"$f":"IF('Customer Info'!$E$17=0,J11*(IF(B11=0, 1,24/B11)),J11*'Customer Info'!$E$17*(IF(B11=0, 1,24/B11)))","v":0}]
[null,null,null,null,null,null,null,null,null,0,{"$f":"IF('Customer Info'!$E$17=0,J12*(IF(B12=0, 1,24/B12)),J12*'Customer Info'!$E$17*(IF(B12=0, 1,24/B12)))","v":0}]
[null,null,null,null,null,null,null,null,null,0,{"$f":"IF('Customer Info'!$E$17=0,J13*(IF(B13=0, 1,24/B13)),J13*'Customer Info'!$E$17*(IF(B13=0, 1,24/B13)))","v":0}]
[null,null,null,null,null,null,null,null,null,0,{"$f":"IF('Customer Info'!$E$17=0,J14*(IF(B14=0, 1,24/B14)),J14*'Customer Info'!$E$17*(IF(B14=0, 1,24/B14)))","v":0}]
[null,null,null,null,null,null,null,null,null,0,{"$f":"IF('Customer Info'!$E$17=0,J15*(IF(B15=0, 1,24/B15)),J15*'Customer Info'!$E$17*(IF(B15=0, 1,24/B15)))","v":0}]
[null,null,null,null,null,null,null,null,null,0,{"$f":"IF('Customer Info'!$E$17=0,J16*(IF(B16=0, 1,24/B16)),J16*'Customer Info'!$E$17*(IF(B16=0, 1,24/B16)))","v":0}]
[null,null,null,null,null,null,null,null,null,0,{"$f":"IF('Customer Info'!$E$17=0,J17*(IF(B17=0, 1,24/B17)),J17*'Customer Info'!$E$17*(IF(B17=0, 1,24/B17)))","v":0}]
[null,null,null,null,null,null,null,null,null,0,{"$f":"IF('Customer Info'!$E$17=0,J18*(IF(B18=0, 1,24/B18)),J18*'Customer Info'!$E$17*(IF(B18=0, 1,24/B18)))","v":0}]
[null,null,null,null,null,null,null,null,null,0,{"$f":"IF('Customer Info'!$E$17=0,J19*(IF(B19=0, 1,24/B19)),J19*'Customer Info'!$E$17*(IF(B19=0, 1,24/B19)))","v":0}]
[null,null,null,null,null,null,null,null,null,0,{"$f":"IF('Customer Info'!$E$17=0,J20*(IF(B20=0, 1,24/B20)),J20*'Customer Info'!$E$17*(IF(B20=0, 1,24/B20)))","v":0}]
[null,null,null,null,null,null,null,null,null,0,{"$f":"IF('Customer Info'!$E$17=0,J21*(IF(B21=0, 1,24/B21)),J21*'Customer Info'!$E$17*(IF(B21=0, 1,24/B21)))","v":0}]
[null,null,null,null,null,null,null,null,null,0,{"$f":"IF('Customer Info'!$E$17=0,J22*(IF(B22=0, 1,24/B22)),J22*'Customer Info'!$E$17*(IF(B22=0, 1,24/B22)))","v":0}]
[null,null,null,null,null,null,null,null,null,0,{"$f":"IF('Customer Info'!$E$17=0,J23*(IF(B23=0, 1,24/B23)),J23*'Customer Info'!$E$17*(IF(B23=0, 1,24/B23)))","v":0}]
[null,null,null,null,null,null,null,null,null,0,{"$f":"IF('Customer Info'!$E$17=0,J24*(IF(B24=0, 1,24/B24)),J24*'Customer Info'!$E$17*(IF(B24=0, 1,24/B24)))","v":0}]
[null,null,null,null,null,null,null,null,null,0,{"$f":"IF('Customer Info'!$E$17=0,J25*(IF(B25=0, 1,24/B25)),J25*'Customer Info'!$E$17*(IF(B25=0, 1,24/B25)))","v":0}]
[null,null,null,null,null,null,null,null,null,0,{"$f":"IF('Customer Info'!$E$17=0,J26*(IF(B26=0, 1,24/B26)),J26*'Customer Info'!$E$17*(IF(B26=0, 1,24/B26)))","v":0}]
[null,null,null,null,null,null,null,null,null,0,{"$f":"IF('Customer Info'!$E$17=0,J27*(IF(B27=0, 1,24/B27)),J27*'Customer Info'!$E$17*(IF(B27=0, 1,24/B27)))","v":0}]
[null,null,null,null,null,null,null,null,null,0,{"$f":"IF('Customer Info'!$E$17=0,J28*(IF(B28=0, 1,24/B28)),J28*'Customer Info'!$E$17*(IF(B28=0, 1,24/B28)))","v":0}]
[null,null,null,null,null,null,null,null,null,0,{"$f":"IF('Customer Info'!$E$17=0,J29*(IF(B29=0, 1,24/B29)),J29*'Customer Info'!$E$17*(IF(B29=0, 1,24/B29)))","v":0}]
[null,null,null,null,null,null,null,null,null,0,{"$f":"IF('Customer Info'!$E$17=0,J30*(IF(B30=0, 1,24/B30)),J30*'Customer Info'!$E$17*(IF(B30=0, 1,24/B30)))","v":0}]
[null,null,null,null,null,null,null,null,null,0,{"$f":"IF('Customer Info'!$E$17=0,J31*(IF(B31=0, 1,24/B31)),J31*'Customer Info'!$E$17*(IF(B31=0, 1,24/B31)))","v":0}]
[null,null,null,null,null,null,null,null,null,0,{"$f":"IF('Customer Info'!$E$17=0,J32*(IF(B32=0, 1,24/B32)),J32*'Customer Info'!$E$17*(IF(B32=0, 1,24/B32)))","v":0}]
[null,null,null,null,null,null,null,null,null,0,{"$f":"IF('Customer Info'!$E$17=0,J33*(IF(B33=0, 1,24/B33)),J33*'Customer Info'!$E$17*(IF(B33=0, 1,24/B33)))","v":0}]
[null,null,null,null,null,null,null,null,null,0,{"$f":"IF('Customer Info'!$E$17=0,J34*(IF(B34=0, 1,24/B34)),J34*'Customer Info'!$E$17*(IF(B34=0, 1,24/B34)))","v":0}]
[null,null,null,null,null,null,null,null,null,0,{"$f":"IF('Customer Info'!$E$17=0,J35*(IF(B35=0, 1,24/B35)),J35*'Customer Info'!$E$17*(IF(B35=0, 1,24/B35)))","v":0}]
[null,null,null,null,null,null,null,null,null,0,{"$f":"IF('Customer Info'!$E$17=0,J36*(IF(B36=0, 1,24/B36)),J36*'Customer Info'!$E$17*(IF(B36=0, 1,24/B36)))","v":0}]
[null,null,null,null,null,null,null,null,null,0,{"$f":"IF('Customer Info'!$E$17=0,J37*(IF(B37=0, 1,24/B37)),J37*'Customer Info'!$E$17*(IF(B37=0, 1,24/B37)))","v":0}]
[null,null,null,null,null,null,null,null,null,0,{"$f":"IF('Customer Info'!$E$17=0,J38*(IF(B38=0, 1,24/B38)),J38*'Customer Info'!$E$17*(IF(B38=0, 1,24/B38)))","v":0}]
[null,null,null,null,null,null,null,null,null,0,{"$f":"IF('Customer Info'!$E$17=0,J39*(IF(B39=0, 1,24/B39)),J39*'Customer Info'!$E$17*(IF(B39=0, 1,24/B39)))","v":0}]
[null,null,null,null,null,null,null,null,null,0,{"$f":"IF('Customer Info'!$E$17=0,J40*(IF(B40=0, 1,24/B40)),J40*'Customer Info'!$E$17*(IF(B40=0, 1,24/B40)))","v":0}]
[null,null,null,null,null,null,null,null,null,0,{"$f":"IF('Customer Info'!$E$17=0,J41*(IF(B41=0, 1,24/B41)),J41*'Customer Info'!$E$17*(IF(B41=0, 1,24/B41)))","v":0}]
[null,null,null,null,null,null,null,null,null,0,{"$f":"IF('Customer Info'!$E$17=0,J42*(IF(B42=0, 1,24/B42)),J42*'Customer Info'!$E$17*(IF(B42=0, 1,24/B42)))","v":0}]
[null,null,null,null,null,null,null,null,null,0,{"$f":"IF('Customer Info'!$E$17=0,J43*(IF(B43=0, 1,24/B43)),J43*'Customer Info'!$E$17*(IF(B43=0, 1,24/B43)))","v":0}]
[null,null,null,null,null,null,null,null,null,0,{"$f":"IF('Customer Info'!$E$17=0,J44*(IF(B44=0, 1,24/B44)),J44*'Customer Info'!$E$17*(IF(B44=0, 1,24/B44)))","v":0}]
[null,null,null,null,null,null,null,null,null,0,{"$f":"IF('Customer Info'!$E$17=0,J45*(IF(B45=0, 1,24/B45)),J45*'Customer Info'!$E$17*(IF(B45=0, 1,24/B45)))","v":0}]
[null,null,null,null,null,null,null,null,null,0,{"$f":"IF('Customer Info'!$E$17=0,J46*(IF(B46=0, 1,24/B46)),J46*'Customer Info'!$E$17*(IF(B46=0, 1,24/B46)))","v":0}]
[null,null,null,null,null,null,null,null,null,0,{"$f":"IF('Customer Info'!$E$17=0,J47*(IF(B47=0, 1,24/B47)),J47*'Customer Info'!$E$17*(IF(B47=0, 1,24/B47)))","v":0}]
[null,null,null,null,null,null,null,null,null,0,{"$f":"IF('Customer Info'!$E$17=0,J48*(IF(B48=0, 1,24/B48)),J48*'Customer Info'!$E$17*(IF(B48=0, 1,24/B48)))","v":0}]
[null,null,null,null,null,null,null,null,null,0,{"$f":"IF('Customer Info'!$E$17=0,J49*(IF(B49=0, 1,24/B49)),J49*'Customer Info'!$E$17*(IF(B49=0, 1,24/B49)))","v":0}]
[null,null,null,null,null,null,null,null,null,0,{"$f":"IF('Customer Info'!$E$17=0,J50*(IF(B50=0, 1,24/B50)),J50*'Customer Info'!$E$17*(IF(B50=0, 1,24/B50)))","v":0}]
[null,null,null,null,null,null,null,null,null,0,{"$f":"IF('Customer Info'!$E$17=0,J51*(IF(B51=0, 1,24/B51)),J51*'Customer Info'!$E$17*(IF(B51=0, 1,24/B51)))","v":0}]
[null,null,null,null,null,null,null,null,null,0,{"$f":"IF('Customer Info'!$E$17=0,J52*(IF(B52=0, 1,24/B52)),J52*'Customer Info'!$E$17*(IF(B52=0, 1,24/B52)))","v":0}]
[null,null,null,null,null,null,null,null,null,0,{"$f":"IF('Customer Info'!$E$17=0,J53*(IF(B53=0, 1,24/B53)),J53*'Customer Info'!$E$17*(IF(B53=0, 1,24/B53)))","v":0}]
[null,null,null,null,null,null,null,null,null,0,{"$f":"IF('Customer Info'!$E$17=0,J54*(IF(B54=0, 1,24/B54)),J54*'Customer Info'!$E$17*(IF(B54=0, 1,24/B54)))","v":0}]
[null,null,null,null,null,null,null,null,null,0,{"$f":"IF('Customer Info'!$E$17=0,J55*(IF(B55=0, 1,24/B55)),J55*'Customer Info'!$E$17*(IF(B55=0, 1,24/B55)))","v":0}]
[null,null,null,null,null,null,null,null,null,0,{"$f":"IF('Customer Info'!$E$17=0,J56*(IF(B56=0, 1,24/B56)),J56*'Customer Info'!$E$17*(IF(B56=0, 1,24/B56)))","v":0}]
[null,null,null,null,null,null,null,null,null,0,{"$f":"IF('Customer Info'!$E$17=0,J57*(IF(B57=0, 1,24/B57)),J57*'Customer Info'!$E$17*(IF(B57=0, 1,24/B57)))","v":0}]
[null,null,null,null,null,null,null,null,null,0,{"$f":"IF('Customer Info'!$E$17=0,J58*(IF(B58=0, 1,24/B58)),J58*'Customer Info'!$E$17*(IF(B58=0, 1,24/B58)))","v":0}]
[null,null,null,null,null,null,null,null,null,0,{"$f":"IF('Customer Info'!$E$17=0,J59*(IF(B59=0, 1,24/B59)),J59*'Customer Info'!$E$17*(IF(B59=0, 1,24/B59)))","v":0}]
[null,null,null,null,null,null,null,null,null,0,{"$f":"IF('Customer Info'!$E$17=0,J60*(IF(B60=0, 1,24/B60)),J60*'Customer Info'!$E$17*(IF(B60=0, 1,24/B60)))","v":0}]
[null,null,null,null,null,null,null,null,null,0,{"$f":"IF('Customer Info'!$E$17=0,J61*(IF(B61=0, 1,24/B61)),J61*'Customer Info'!$E$17*(IF(B61=0, 1,24/B61)))","v":0}]
[null,null,null,null,null,null,null,null,null,0,{"$f":"IF('Customer Info'!$E$17=0,J62*(IF(B62=0, 1,24/B62)),J62*'Customer Info'!$E$17*(IF(B62=0, 1,24/B62)))","v":0}]
[null,null,null,null,null,null,null,null,null,0,{"$f":"IF('Customer Info'!$E$17=0,J63*(IF(B63=0, 1,24/B63)),J63*'Customer Info'!$E$17*(IF(B63=0, 1,24/B63)))","v":0}]
[null,null,null,null,null,null,null,null,null,0,{"$f":"IF('Customer Info'!$E$17=0,J64*(IF(B64=0, 1,24/B64)),J64*'Customer Info'!$E$17*(IF(B64=0, 1,24/B64)))","v":0}]
[null,null,null,null,null,null,null,null,null,0,{"$f":"IF('Customer Info'!$E$17=0,J65*(IF(B65=0, 1,24/B65)),J65*'Customer Info'!$E$17*(IF(B65=0, 1,24/B65)))","v":0}]
[null,null,null,null,null,null,null,null,null,0,{"$f":"IF('Customer Info'!$E$17=0,J66*(IF(B66=0, 1,24/B66)),J66*'Customer Info'!$E$17*(IF(B66=0, 1,24/B66)))","v":0}]
[null,null,null,null,null,null,null,null,null,0,{"$f":"IF('Customer Info'!$E$17=0,J67*(IF(B67=0, 1,24/B67)),J67*'Customer Info'!$E$17*(IF(B67=0, 1,24/B67)))","v":0}]
[null,null,null,null,null,null,null,null,null,0,{"$f":"IF('Customer Info'!$E$17=0,J68*(IF(B68=0, 1,24/B68)),J68*'Customer Info'!$E$17*(IF(B68=0, 1,24/B68)))","v":0}]
[null,null,null,null,null,null,null,null,null,0,{"$f":"IF('Customer Info'!$E$17=0,J69*(IF(B69=0, 1,24/B69)),J69*'Customer Info'!$E$17*(IF(B69=0, 1,24/B69)))","v":0}]
[null,null,null,null,null,null,null,null,null,0,{"$f":"IF('Customer Info'!$E$17=0,J70*(IF(B70=0, 1,24/B70)),J70*'Customer Info'!$E$17*(IF(B70=0, 1,24/B70)))","v":0}]
[null,null,null,null,null,null,null,null,null,0,{"$f":"IF('Customer Info'!$E$17=0,J71*(IF(B71=0, 1,24/B71)),J71*'Customer Info'!$E$17*(IF(B71=0, 1,24/B71)))","v":0}]
[null,null,null,null,null,null,null,null,null,0,{"$f":"IF('Customer Info'!$E$17=0,J72*(IF(B72=0, 1,24/B72)),J72*'Customer Info'!$E$17*(IF(B72=0, 1,24/B72)))","v":0}]
[null,null,null,null,null,null,null,null,null,0,{"$f":"IF('Customer Info'!$E$17=0,J73*(IF(B73=0, 1,24/B73)),J73*'Customer Info'!$E$17*(IF(B73=0, 1,24/B73)))","v":0}]
[null,null,null,null,null,null,null,null,null,{"$f":"H74-G74","v":0},{"$f":"IF('Customer Info'!$E$17=0,J74*(IF(B74=0, 1,24/B74)),J74*'Customer Info'!$E$17*(IF(B74=0, 1,24/B74)))","v":0}]
[null,null,null,null,null,null,null,null,null,0,{"$f":"IF('Customer Info'!$E$17=0,J75*(IF(B75=0, 1,24/B75)),J75*'Customer Info'!$E$17*(IF(B75=0, 1,24/B75)))","v":0}]
[null,null,null,null,null,null,null,null,null,0,{"$f":"IF('Customer Info'!$E$17=0,J76*(IF(B76=0, 1,24/B76)),J76*'Customer Info'!$E$17*(IF(B76=0, 1,24/B76)))","v":0}]
[null,null,null,null,null,null,null,null,null,0,{"$f":"IF('Customer Info'!$E$17=0,J77*(IF(B77=0, 1,24/B77)),J77*'Customer Info'!$E$17*(IF(B77=0, 1,24/B77)))","v":0}]
[null,null,null,null,null,null,null,null,null,0,{"$f":"IF('Customer Info'!$E$17=0,J78*(IF(B78=0, 1,24/B78)),J78*'Customer Info'!$E$17*(IF(B78=0, 1,24/B78)))","v":0}]
[null,null,null,null,null,null,null,null,null,0,{"$f":"IF('Customer Info'!$E$17=0,J79*(IF(B79=0, 1,24/B79)),J79*'Customer Info'!$E$17*(IF(B79=0, 1,24/B79)))","v":0}]
[null,null,null,null,null,null,null,null,null,0,{"$f":"IF('Customer Info'!$E$17=0,J80*(IF(B80=0, 1,24/B80)),J80*'Customer Info'!$E$17*(IF(B80=0, 1,24/B80)))","v":0}]
{"$rows_left_out":648}
{"sheet":"Overview","index":3,"n_rows":181,"n_cols":7,"rows_kept":181,"cut":false,"hidden":false,"merged":[[178,1,178,2],[177,5,177,6],[178,5,178,6],[23,1,23,7],[49,1,49,7],[75,1,75,7],[102,1,102,7],[153,0,154,8],[129,0,130,8],[132,1,132,7],[156,1,156,7],[126,1,127,7],[176,1,176,6],[173,0,174,8],[0,0,3,8],[20,0,21,8],[9,4,11,5],[12,4,12,5],[5,0,6,8],[14,6,14,7],[15,6,15,7],[17,6,17,7],[18,6,18,7],[16,6,16,7],[8,1,8,7]]}
["Food Waste Assessment Results"]
[]
[]
[]
[]
["Summary Information"]
[]
[]
[null,"Total Food Waste Generated"]
[null,"Summary","lbs","tons"]
[null,"Daily Food Waste",{"$f":"C19","v":0},{"$f":"C11/2000","v":0}]
[null,"Weekly Food Waste",{"$f":"D19","v":0},{"$f":"C12/2000","v":0}]
[null,"Yearly Food Waste",{"$f":"F19","v":0},{"$f":"C13/2000","v":0}]
[]
[null,"Disposal Summary (lbs)","per day","per week","per month","per year","percent"]
[null,"Landfilled Food",{"$f":"GETPIVOTDATA(\"Scaled Food Weight (lbs)\",$B$54)","v":0},{"$f":"C16*7","v":0},{"$f":"C16*365/12","v":0},{"$f":"C16*365","v":0},{"$f":"IF($F$19=0,0,F16/$F$19)","v":0}]
[null,"Donated Food",{"$f":"GETPIVOTDATA(\"Scaled Food Weight (lbs)\",$B$80)","v":0},{"$f":"C17*7","v":0},{"$f":"C17*365/12","v":0},{"$f":"C17*365","v":0},{"$f":"IF($F$19=0,0,F17/$F$19)","v":0}]
[null,"Recycled Food",{"$f":"GETPIVOTDATA(\"Scaled Food Weight (lbs)\",$B$107)","v":0},0,0,0,{"$f":"IF($F$19=0,0,F18/$F$19)","v":0}]
[null,"Total",{"$f":"GETPIVOTDATA(\"Scaled Food Weight (lbs)\",$B$28)","v":0},{"$f":"C19*7","v":0},{"$f":"C19*365/12","v":0},{"$f":"C19*365","v":0},{"$f":"SUM(G16:H18)","v":0}]
[]
["Department Information Overview"]
[]
[]
[null,"Total Food Waste Distribution by Department"]
[null,"Percent of Total",{"$f":"G19","v":0}]
[null,"Disposal Method","(Multiple Items)"]
[]
[null,"Source Location","Food Weight (lbs/day)"]
[null,"cheese",0]
[null,"produce",0]
[null,"other2",0]
[null,"dairy",0]
[null,"seafood",0]
[null,"deli",0]
[null,"other1",0]
[null,"meat",0]
[null,"bakery",0]
[null,"prepared",0]
[null,"Total",0]
[]
[]
[]
[]
[]
[]
[null,"See Department Tab for more details"]
[]
[]
[]
[null,"Landfilled Food Scraps by Department"]
[null,"Percent of Total",{"$f":"G16","v":0}]
[null,"Disposal Method","landfill"]
[]
[null,"Source Location","Food Weight (lbs/day)"]
[null,"cheese",0]
[null,"produce",0]
[null,"other2",0]
[null,"dairy",0]
[null,"seafood",0]
[null,"deli",0]
[null,"other1",0]
[null,"meat",0]
[null,"bakery",0]
[null,"prepared",0]
[null,"Landfill Total",0]
[]
[]
[]
[]
[]
[]
[]
[null,"See Department Tab for more details"]
[]
[]
[null,"Donated Surplus by Department"]
[null,"Percent of Total",{"$f":"G17","v":0}]
[null,"Disposal Method","donation"]
[]
[null,"Source Location","Food Weight (lbs/day)"]
{"$rows_left_out":102}
{"sheet":"Department","index":4,"n_rows":7,"n_cols":32,"rows_kept":7,"cut":false,"hidden":false,"merged":[]}
["Food Waste by Department: Includes all food waste items regardless of disposal method."]
[]
[{"$f":"B4","v":"bakery"},null,null,{"$f":"E4","v":"cheese"},null,null,{"$f":"H4","v":"dairy"},null,null,{"$f":"K4","v":"deli"},null,null,{"$f":"N4","v":"deli"},null,null,{"$f":"Q4","v":"meat"},null,null,{"$f":"T4","v":"prepared"},null,null,{"$f":"W4","v":"produce"},null,null,{"$f":"Z4","v":"seafood"},null,null,{"$f":"AC4","v":"other1"},null,null,{"$f":"AF4","v":"other2"}]
["Source Location","bakery",null,"Source Location","cheese",null,"Source Location","dairy",null,"Source Location","deli",null,"Source Location","deli",null,"Source Location","meat",null,"Source Location","prepared",null,"Source Location","produce",null,"Source Location","seafood",null,"Source Location","other1",null,"Source Location","other2"]
[]
["Source Location","Food Weight (lbs/day)",null,"Source Location","Food Weight (lbs/day)",null,"Source Location","Food Weight (lbs/day)",null,"Source Location","Food Weight (lbs/day)",null,"Source Location","Food Weight (lbs/day)",null,"Source Location","Food Weight (lbs/day)",null,"Source Location","Food Weight (lbs/day)",null,"Source Location","Food Weight (lbs/day)",null,"Source Location","Food Weight (lbs/day)",null,"Source Location","Food Weight (lbs/day)",null,"Source Location","Food Weight (lbs/day)"]
["Total",null,null,"Total",null,null,"Total",null,null,"Total",null,null,"Total",null,null,"Total",null,null,"Total",null,null,"Total",null,null,"Total",null,null,"Total",null,null,"Total"]

{"sheet":"Loss Reason","index":5,"n_rows":7,"n_cols":20,"rows_kept":7,"cut":false,"hidden":false,"merged":[]}
["Food Waste by Loss Reason: Includes all food waste items regardless of disposal method."]
[]
[{"$f":"B4","v":"prep waste"},null,null,{"$f":"E4","v":"plate waste"},null,null,{"$f":"H4","v":"expired"},null,null,{"$f":"K4","v":"surplus"},null,null,{"$f":"N4","v":"quality"},null,null,{"$f":"Q4","v":"return"},null,null,{"$f":"T4","v":"other"}]
["Loss Reason","prep waste",null,"Loss Reason","plate waste",null,"Loss Reason","expired",null,"Loss Reason","surplus",null,"Loss Reason","quality",null,"Loss Reason","return",null,"Loss Reason","other"]
[]
["Source Location","Food Weight (lbs/day)",null,"Source Location","Food Weight (lbs/day)",null,"Source Location","Food Weight (lbs/day)",null,"Source Location","Food Weight (lbs/day)",null,"Source Location","Food Weight (lbs/day)",null,"Source Location","Food Weight (lbs/day)",null,"Source Location","Food Weight (lbs/day)"]
["Total",null,null,"Total",null,null,"Total",null,null,"Total",null,null,"Total",null,null,"Total",null,null,"Total"]

{"sheet":"Surplus","index":6,"n_rows":43,"n_cols":12,"rows_kept":43,"cut":false,"hidden":false,"merged":[[0,1,3,11],[37,7,37,8],[37,10,37,11],[32,4,32,5],[9,1,9,5],[9,7,9,11],[32,7,32,11],[32,1,32,2]]}
[null,"Food Waste Assessment Results"]
[]
[]
[]
[]
[]
[]
[]
[]
[null,"Increasing Food Waste Prevention",null,null,null,null,null,"Increasing Food Waste Donation"]
[]
[]
[]
[]
[]
[]
[]
[]
[]
[]
[]
[]
[]
[]
[]
[]
[]
[]
[]
[]
[]
[]
[null,"Surplus Food Details",null,null,"Surplus Food Impact",null,null,"Donation Summary"]
[null,"Loss Reason","surplus",null,{"$f":"GETPIVOTDATA(\"Scaled Food Weight (lbs)\",$B$36)","v":0},"lbs/day",null,null,"Lbs/day",null,"Lbs/year","% Increase"]
[null,null,null,null,{"$f":"E34*365","v":0},"lbs/year",null,"Current Amount",{"$f":"GETPIVOTDATA(\"Scaled Food Weight (lbs)\",$H$41)","v":0},null,{"$f":"I35*365","v":0},"-"]
[null,"Source Location","Food Weight (lbs/day)",null,null,null,null,"Potential Amount",{"$f":"GETPIVOTDATA(\"Scaled Food Weight (lbs)\",$K$42)+I35","v":0},null,{"$f":"(I36-I35)*365 + K35","v":0},{"$f":"IF(I35=0,100,((I36-I35)/I35)*100)","v":100}]
[null,"Total"]
[null,null,null,null,null,null,null,"Current Donation",null,null,"Potential to Donate"]
[null,null,null,null,null,null,null,"Disposal Method","donation",null,"Loss Reason","surplus"]
[null,null,null,null,null,null,null,null,null,null,"Disposal Method","(Multiple Items)"]
[null,null,null,null,null,null,null,"Source Location","Weight (lbs/day)"]
[null,null,null,null,null,null,null,"Total",null,null,"Source Location","Weight (lbs/day)"]
[null,null,null,null,null,null,null,null,null,null,"Total"]

{"sheet":"Recycling","index":7,"n_rows":49,"n_cols":6,"rows_kept":49,"cut":false,"hidden":false,"merged":[[9,1,9,5],[33,1,33,5],[43,1,43,2],[43,4,43,5],[0,1,3,5]]}
[null,"Food Waste Assessment Results"]
[]
[]
[]
[]
[]
[]
[]
[]
[null,"Increasing Food Waste Recycling"]
[]
[]
[]
[]
[]
[null,null,null,null,null,"v"]
[]
[]
[]
[]
[]
[]
[]
[]
[]
[]
[]
[]
[]
[]
[]
[]
[]
[null,"Recycling Summary"]
[null,null,"Lbs/day",null,"Lbs/year","% Increase"]
[null,"Current Recycled Amount",{"$f":"GETPIVOTDATA(\"Scaled Food Weight (lbs)\",$B$48)","v":0},null,{"$f":"C36*365","v":0},"-"]
[null,"Potential Recycled Amount",{"$f":"GETPIVOTDATA(\"Scaled Food Weight (lbs)\",$E$48)+C36","v":0},null,{"$f":"C37*365","v":0},{"$f":"IF(C36=0,C37/100,((C37-C36)/C36))*100","v":0}]
[]
[]
[]
[]
[]
[]
[null,"Current Recycling",null,null,"Additional Potential to Recycle"]
[null,null,null,null,"Loss Reason","(Multiple Items)"]
[null,"Disposal Method","(Multiple Items)",null,"Disposal Method","landfill"]
[]
[null,"Source Location","Food Weight (lbs/day)",null,"Source Location","Food Weight (lbs/day)"]
[null,"Total",0,null,"Total",0]